Bug 554 - can't build elfutils 0.155 unit tests
Summary: can't build elfutils 0.155 unit tests
Status: CONFIRMED
Alias: None
Product: SprezzOS
Classification: Unclassified
Component: World (show other bugs)
Version: 0.0.0 (Turing)
Hardware: All All
: P3 normal
Target Milestone: 2.0.0 (Kolmogorov)
Assignee: Nick Black
URL:
Keywords: devsupport
Depends on:
Blocks:
 
Reported: 2012-12-26 20:17 EST by Nick Black
Modified: 2013-01-01 02:08 EST (History)
1 user (show)

See Also:


Attachments

Note You need to log in before you can comment on or make changes to this bug.
Description Nick Black 2012-12-26 20:17:13 EST
make[2]: `arextract' is up to date.
make[2]: `arsymtest' is up to date.
make[2]: `newfile' is up to date.
make[2]: `saridx' is up to date.
make[2]: `scnnames' is up to date.
make[2]: `sectiondump' is up to date.
make[2]: `showptable' is up to date.
make[2]: `update1' is up to date.
make[2]: `update2' is up to date.
make[2]: `update3' is up to date.
make[2]: `update4' is up to date.
make[2]: `test-nlist' is up to date.
make[2]: `show-die-info' is up to date.
make[2]: `get-files' is up to date.
make[2]: `get-lines' is up to date.
make[2]: `get-pubnames' is up to date.
make[2]: `get-aranges' is up to date.
make[2]: `allfcts' is up to date.
make[2]: `line2addr' is up to date.
make[2]: `addrscopes' is up to date.
make[2]: `funcscopes' is up to date.
make[2]: `show-abbrev' is up to date.
make[2]: `hash' is up to date.
make[2]: `newscn' is up to date.
make[2]: `ecp' is up to date.
make[2]: `dwflmodtest' is up to date.
make[2]: `find-prologues' is up to date.
make[2]: `funcretval' is up to date.
make[2]: `allregs' is up to date.
make[2]: `rdwrmmap' is up to date.
make[2]: `dwfl-bug-addr-overflow' is up to date.
make[2]: `arls' is up to date.
make[2]: `dwfl-bug-fd-leak' is up to date.
make[2]: `dwfl-addr-sect' is up to date.
make[2]: `dwfl-bug-report' is up to date.
make[2]: `early-offscn' is up to date.
make[2]: `dwfl-bug-getmodules' is up to date.
make[2]: `dwarf-getmacros' is up to date.
make[2]: `addrcfi' is up to date.
make[2]: `test-flag-nobits' is up to date.
make[2]: `dwarf-getstring' is up to date.
make[2]: `rerequest_tag' is up to date.
make[2]: `alldts' is up to date.
make[2]: `md5-sha1-test' is up to date.
make[2]: `typeiter' is up to date.
make[2]: `low_high_pc' is up to date.
make[2]: `test-elf_cntl_gelf_getshdr' is up to date.
make[2]: `msg_tst' is up to date.
make[2]: `md5-sha1-test' is up to date.
make[2]: `asm-tst1' is up to date.
make[2]: `asm-tst2' is up to date.
make[2]: `asm-tst3' is up to date.
make[2]: `asm-tst4' is up to date.
make[2]: `asm-tst5' is up to date.
make[2]: `asm-tst6' is up to date.
make[2]: `asm-tst7' is up to date.
make[2]: `asm-tst8' is up to date.
make[2]: `asm-tst9' is up to date.
make[2]: Leaving directory `/media/build/world/elfutils_0.155/tests'
make  check-TESTS
make[2]: Entering directory `/media/build/world/elfutils_0.155/tests'
Extracting symbols... done
PASS: run-arextract.sh
PASS: run-arsymtest.sh
PASS: newfile
PASS: test-nlist
PASS: update1
PASS: update2
PASS: update3
PASS: update4
PASS: run-show-die-info.sh
PASS: run-get-files.sh
PASS: run-get-lines.sh
PASS: run-get-pubnames.sh
PASS: run-get-aranges.sh
PASS: run-allfcts.sh
PASS: run-show-abbrev.sh
PASS: run-line2addr.sh
PASS: hash
PASS: newscn
PASS: run-strip-test.sh
PASS: run-strip-test2.sh
PASS: run-strip-test3.sh
PASS: run-strip-test4.sh
PASS: run-strip-test5.sh
PASS: run-strip-test6.sh
PASS: run-strip-test7.sh
PASS: run-strip-test8.sh
PASS: run-strip-groups.sh
PASS: run-strip-reloc.sh
PASS: run-unstrip-test.sh
PASS: run-unstrip-test2.sh
PASS: run-ecp-test.sh
PASS: run-ecp-test2.sh
PASS: run-alldts.sh
PASS: run-elflint-test.sh
section [ 6] '.dynsym': symbol 63: st_value out of bounds
section [36] '.symtab': symbol 125: st_value out of bounds
*** failure in ../src/elflint --quiet --gnu-ld ../src/addr2line
section [37] '.symtab': symbol 169: st_value out of bounds
*** failure in ../src/elflint --quiet --gnu-ld ../src/elfcmp
section [37] '.symtab': symbol 270: st_value out of bounds
*** failure in ../src/elflint --quiet --gnu-ld ../src/elflint
section [ 6] '.dynsym': symbol 192: st_value out of bounds
section [37] '.symtab': symbol 305: st_value out of bounds
section [37] '.symtab': symbol 468: st_value out of bounds
*** failure in ../src/elflint --quiet --gnu-ld ../src/ld
section [ 6] '.dynsym': symbol 102: st_value out of bounds
section [37] '.symtab': symbol 234: st_value out of bounds
*** failure in ../src/elflint --quiet --gnu-ld ../src/nm
section [37] '.symtab': symbol 204: st_value out of bounds
*** failure in ../src/elflint --quiet --gnu-ld ../src/objdump
section [ 6] '.dynsym': symbol 148: st_value out of bounds
section [37] '.symtab': symbol 387: st_value out of bounds
*** failure in ../src/elflint --quiet --gnu-ld ../src/readelf
section [36] '.symtab': symbol 111: st_value out of bounds
*** failure in ../src/elflint --quiet --gnu-ld ../src/size
section [37] '.symtab': symbol 220: st_value out of bounds
*** failure in ../src/elflint --quiet --gnu-ld ../src/strip
section [37] '.symtab': symbol 311: st_value out of bounds
*** failure in ../src/elflint --quiet --gnu-ld ../libelf/libelf.so
section [37] '.symtab': symbol 619: st_value out of bounds
*** failure in ../src/elflint --quiet --gnu-ld ../libdw/libdw.so
FAIL: run-elflint-self.sh
PASS: run-ranlib-test.sh
PASS: run-ranlib-test2.sh
PASS: run-ranlib-test3.sh
PASS: run-ranlib-test4.sh
PASS: run-addrscopes.sh
PASS: run-strings-test.sh
PASS: run-funcscopes.sh
PASS: run-find-prologues.sh
PASS: run-allregs.sh
PASS: run-nm-self.sh
PASS: run-readelf-self.sh
PASS: run-readelf-test1.sh
PASS: run-readelf-test2.sh
PASS: run-readelf-test3.sh
PASS: run-readelf-test4.sh
PASS: run-readelf-twofiles.sh
PASS: run-readelf-macro.sh
PASS: run-native-test.sh
PASS: run-bug1-test.sh
PASS: dwfl-bug-addr-overflow
PASS: run-addrname-test.sh
PASS: dwfl-bug-fd-leak
PASS: dwfl-bug-report
PASS: run-dwfl-bug-offline-rel.sh
PASS: run-dwfl-addr-sect.sh
PASS: run-disasm-x86.sh
PASS: run-disasm-x86-64.sh
PASS: run-early-offscn.sh
PASS: run-dwarf-getmacros.sh
PASS: run-test-flag-nobits.sh
PASS: run-prelink-addr-test.sh
PASS: run-dwarf-getstring.sh
PASS: run-rerequest_tag.sh
PASS: run-typeiter.sh
PASS: run-readelf-d.sh
PASS: run-readelf-gdb_index.sh
PASS: run-unstrip-n.sh
PASS: run-low_high_pc.sh
PASS: run-macro-test.sh
PASS: run-elf_cntl_gelf_getshdr.sh
PASS: run-test-archive64.sh
PASS: msg_tst
PASS: md5-sha1-test
PASS: asm-tst1
PASS: asm-tst2
PASS: asm-tst3
PASS: asm-tst4
PASS: asm-tst5
PASS: asm-tst6
PASS: asm-tst7
PASS: asm-tst8
PASS: asm-tst9
=============================================
1 of 87 tests failed
Please report to https://bugzilla.redhat.com/
=============================================
make[2]: *** [check-TESTS] Error 1
make[2]: Leaving directory `/media/build/world/elfutils_0.155/tests'
make[1]: *** [check-am] Error 2
make[1]: Leaving directory `/media/build/world/elfutils_0.155/tests'
make: *** [check-recursive] Error 1
[skynet](2) $ ls

this is either within a package build or a pristine checkout on an interactive command line.
Comment 1 Nick Black 2012-12-26 20:19:04 EST
https://bugzilla.redhat.com/show_bug.cgi?id=890447 has been filed upstream with the RedHat Fedora Bugzilla.
Comment 2 Nick Black 2013-01-01 02:08:16 EST
Mass migration to 2.0